One thought on “GREPowanie plików PDF

  1. Ever

    Hi Ed,I’ve followed your steps, but when i dpkg the dell-laptop-dkms_1.4_all.deb i get an error:Error! Bad reurtn status for module build on kernel: 3.0.0-30-generic (i386)Consult /var/lib/dkms/dell-laptop/1.4/build/make.log for more information.make.log:make: Entering directory `/usr/src/linux-headers-3.0.0-30-generic’ LD /var/lib/dkms/dell-laptop/1.4/build/built-in.o CC [M] /var/lib/dkms/dell-laptop/1.4/build/dell-laptop.o/var/lib/dkms/dell-laptop/1.4/build/dell-laptop.c:569:13: warning: function declaration isn’t a prototype [-Wstrict-prototypes]/var/lib/dkms/dell-laptop/1.4/build/dell-laptop.c: In function ‘dell_touchpadled_on’:/var/lib/dkms/dell-laptop/1.4/build/dell-laptop.c:572:3: error: implicit declaration of function ‘msleep’ [-Werror=implicit-function-declaration]/var/lib/dkms/dell-laptop/1.4/build/dell-laptop.c: At top level:/var/lib/dkms/dell-laptop/1.4/build/dell-laptop.c:582:13: warning: function declaration isn’t a prototype [-Wstrict-prototypes]/var/lib/dkms/dell-laptop/1.4/build/dell-laptop.c:636:13: warning: function declaration isn’t a prototype [-Wstrict-prototypes]cc1: some warnings being treated as errorsmake[1]: *** [/var/lib/dkms/dell-laptop/1.4/build/dell-laptop.o] Error 1make: *** [_module_/var/lib/dkms/dell-laptop/1.4/build] Error 2make: Leaving directory `/usr/src/linux-headers-3.0.0-30-generic’I hope you can help me with this!thanks already;)

    Reply

Dodaj komentarz

Twój adres email nie zostanie opublikowany. Pola, których wypełnienie jest wymagane, są oznaczone symbolem *